Target
Bromodomain-containing protein 4
Ligand
BDBM50365463
Substrate
Meas. Tech.
ChEMBL_1832478 (CHEMBL4332486)
Ki
200±n/a nM
Citation
 Sperandio, DAktoudianakis, VBabaoglu, KChen, XElbel, KChin, GCorkey, BDu, JJiang, BKobayashi, TMackman, RMartinez, RYang, HZablocki, JKusam, SJordan, KWebb, HBates, JGLad, LMish, MNiedziela-Majka, AMetobo, SSapre, AHung, MJin, DFung, WKan, EEisenberg, GLarson, NNewby, ZERLansdon, ETay, CNeve, RMShevick, SLBreckenridge, DG Structure-guided discovery of a novel, potent, and orally bioavailable 3,5-dimethylisoxazole aryl-benzimidazole BET bromodomain inhibitor. Bioorg Med Chem 27:457-469 (2019)  
Target
Name:
Bromodomain-containing protein 4
Synonyms:
BRD4 Bromodomain-containing protein 4 (BRD4) Protein HUNK1
Type:
Protein
Mol. Mass.:
152264.84
Organism:
Homo sapiens (Human)
Description:
O60885
Residue:
1362
  
Inhibitor
Name:
BDBM50365463
Synonyms:
CHEMBL1232461
Type:
Small organic molecule
Emp. Form.:
C22H22ClN5O2
Mol. Mass.:
423.895
SMILES:
CCNC(=O)C[C@@H]1N=C(c2ccc(Cl)cc2)c2cc(OC)ccc2-n2c(C)nnc12
: