Target
Gag-Pol polyprotein [489-587]
Ligand
BDBM150
Substrate
Meas. Tech.
ChEMBL_159973 (CHEMBL768120)
Ki
0.32±n/a nM
Citation
 Wilkerson, WWDax, SCheatham, WW Nonsymmetrically substituted cyclic urea HIV protease inhibitors. J Med Chem 40:4079-88 (1998)  
Target
Name:
Gag-Pol polyprotein [489-587]
Synonyms:
Human immunodeficiency virus type 1 protease Pol polyprotein | gag-pol
Type:
Enzyme Subunit
Mol. Mass.:
10781.16
Organism:
Human immunodeficiency virus type 1
Description:
P04585[489-587]
Residue:
99
  
Inhibitor
Name:
BDBM150
Synonyms:
(4R,5S,6S,7R)-4,7-dibenzyl-5,6-dihydroxy-1,3-bis({[4-(hydroxymethyl)phenyl]methyl})-1,3-diazepan-2-one | DMP323
Type:
Emp. Form.:
C35H38N2O5
Mol. Mass.:
566.6866
SMILES:
OCc1ccc(CN2[C@H](Cc3ccccc3)[C@H](O)[C@@H](O)[C@@H](Cc3ccccc3)N(Cc3ccc(CO)cc3)C2=O)cc1
: