Target
Sodium-dependent dopamine transporter
Ligand
BDBM50450532
Substrate
Meas. Tech.
ChEMBL_184445 (CHEMBL790105)
Ki
39±n/a nM
Citation
 Agoston, GEWu, JHIzenwasser, SGeorge, CKatz, JKline, RHNewman, AH Novel N-substituted 3 alpha-[bis(4'-fluorophenyl)methoxy]tropane analogues: selective ligands for the dopamine transporter. J Med Chem 40:4329-39 (1998)  
Target
Name:
Sodium-dependent dopamine transporter
Synonyms:
DA transporter SC6A3_RAT Sodium-dependent dopamine transporter | Sodium-dependent dopamine transporter (DAT)
Type:
Multi-pass membrane protein
Mol. Mass.:
68749.45
Organism:
Rattus norvegicus (rat)
Description:
P23977
Residue:
619
  
Inhibitor
Name:
BDBM50450532
Synonyms:
CHEMBL2308105
Type:
Small organic molecule
Emp. Form.:
C30H33F2NO
Mol. Mass.:
461.5859
SMILES:
[H][C@]12CC[C@]([H])(C[C@@H](C1)OC(c1ccc(F)cc1)c1ccc(F)cc1)N2CCCCc1ccccc1
: