Target
Sodium-dependent dopamine transporter
Ligand
BDBM50061882
Substrate
Meas. Tech.
ChEMBL_62498 (CHEMBL677555)
Ki
96±n/a nM
Citation
 Agoston, GEWu, JHIzenwasser, SGeorge, CKatz, JKline, RHNewman, AH Novel N-substituted 3 alpha-[bis(4'-fluorophenyl)methoxy]tropane analogues: selective ligands for the dopamine transporter. J Med Chem 40:4329-39 (1998)  
Target
Name:
Sodium-dependent dopamine transporter
Synonyms:
DA transporter SC6A3_RAT Sodium-dependent dopamine transporter | Sodium-dependent dopamine transporter (DAT)
Type:
Multi-pass membrane protein
Mol. Mass.:
68749.45
Organism:
Rattus norvegicus (rat)
Description:
P23977
Residue:
619
  
Inhibitor
Name:
BDBM50061882
Synonyms:
3-[Bis-(4-fluoro-phenyl)-methoxy]-8-(4-fluoro-benzyl)-8-aza-bicyclo[3.2.1]octane | CHEMBL11768
Type:
Small organic molecule
Emp. Form.:
C27H26F3NO
Mol. Mass.:
437.4966
SMILES:
Fc1ccc(CN2C3CCC2CC(C3)OC(c2ccc(F)cc2)c2ccc(F)cc2)cc1
: