Target
Muscarinic acetylcholine receptor M1
Ligand
BDBM50061878
Substrate
Meas. Tech.
ChEMBL_138953 (CHEMBL742765)
Ki
86.4±n/a nM
Citation
 Agoston, GEWu, JHIzenwasser, SGeorge, CKatz, JKline, RHNewman, AH Novel N-substituted 3 alpha-[bis(4'-fluorophenyl)methoxy]tropane analogues: selective ligands for the dopamine transporter. J Med Chem 40:4329-39 (1998)  
Target
Name:
Muscarinic acetylcholine receptor M1
Synonyms:
ACM1_RAT Chrm-1 cholinergic receptor, muscarinic 1
Type:
Enzyme Catalytic Domain
Mol. Mass.:
51390.46
Organism:
RAT
Description:
P08482
Residue:
460
  
Inhibitor
Name:
BDBM50061878
Synonyms:
(E)-1-{3-[Bis-(4-fluoro-phenyl)-methoxy]-8-aza-bicyclo[3.2.1]oct-8-yl}-3-phenyl-propenone | CHEMBL3084927
Type:
Small organic molecule
Emp. Form.:
C29H27F2NO2
Mol. Mass.:
459.527
SMILES:
[H][C@]12CC[C@]([H])(C[C@H](C1)OC(c1ccc(F)cc1)c1ccc(F)cc1)N2C(=O)\C=C\c1ccccc1
: