Target
Muscarinic acetylcholine receptor M1
Ligand
BDBM50061879
Substrate
Meas. Tech.
ChEMBL_138953 (CHEMBL742765)
Ki
773.0±n/a nM
Citation
 Agoston, GEWu, JHIzenwasser, SGeorge, CKatz, JKline, RHNewman, AH Novel N-substituted 3 alpha-[bis(4'-fluorophenyl)methoxy]tropane analogues: selective ligands for the dopamine transporter. J Med Chem 40:4329-39 (1998)  
Target
Name:
Muscarinic acetylcholine receptor M1
Synonyms:
ACM1_RAT Chrm-1 cholinergic receptor, muscarinic 1
Type:
Enzyme Catalytic Domain
Mol. Mass.:
51390.46
Organism:
RAT
Description:
P08482
Residue:
460
  
Inhibitor
Name:
BDBM50061879
Synonyms:
8-Benzyl-3-[2,2-bis-(4-fluoro-phenyl)-ethyl]-8-aza-bicyclo[3.2.1]octane CHEMBL12375
Type:
Small organic molecule
Emp. Form.:
C27H27F2NO
Mol. Mass.:
419.5062
SMILES:
Fc1ccc(cc1)C(OC1CC2CCC(C1)N2Cc1ccccc1)c1ccc(F)cc1
: