Target
Sodium-dependent noradrenaline transporter
Ligand
BDBM50061878
Substrate
Meas. Tech.
ChEMBL_143140 (CHEMBL744184)
Ki
86.4±n/a nM
Citation
 Agoston, GEWu, JHIzenwasser, SGeorge, CKatz, JKline, RHNewman, AH Novel N-substituted 3 alpha-[bis(4'-fluorophenyl)methoxy]tropane analogues: selective ligands for the dopamine transporter. J Med Chem 40:4329-39 (1998)  
Target
Name:
Sodium-dependent noradrenaline transporter
Synonyms:
Monoamine transporter NET Noradrenaline Transporter (NET) Norepinephrine transporter protein (NET) SLC6A2 Sodium-dependent noradrenaline transporter (NET) | Solute carrier family 6 member 2
Type:
Multi-pass membrane protein
Mol. Mass.:
69337.72
Organism:
Homo sapiens (Human)
Description:
P23975
Residue:
617
  
Inhibitor
Name:
BDBM50061878
Synonyms:
(E)-1-{3-[Bis-(4-fluoro-phenyl)-methoxy]-8-aza-bicyclo[3.2.1]oct-8-yl}-3-phenyl-propenone | CHEMBL3084927
Type:
Small organic molecule
Emp. Form.:
C29H27F2NO2
Mol. Mass.:
459.527
SMILES:
[H][C@]12CC[C@]([H])(C[C@H](C1)OC(c1ccc(F)cc1)c1ccc(F)cc1)N2C(=O)\C=C\c1ccccc1
: