Target
Sodium-dependent serotonin transporter
Ligand
BDBM50061881
Substrate
Meas. Tech.
ChEMBL_201968 (CHEMBL804805)
Ki
1190±n/a nM
Citation
 Agoston, GEWu, JHIzenwasser, SGeorge, CKatz, JKline, RHNewman, AH Novel N-substituted 3 alpha-[bis(4'-fluorophenyl)methoxy]tropane analogues: selective ligands for the dopamine transporter. J Med Chem 40:4329-39 (1998)  
Target
Name:
Sodium-dependent serotonin transporter
Synonyms:
5-HT Transporter 5HT transporter Anandamid membrane transporter, AMT Monoamine transporters; Norepinephrine & serotonin Slc6a4 Sodium-dependent serotonin transporter (SERT) | imipramine receptor
Type:
Multi-pass membrane protein
Mol. Mass.:
70168.43
Organism:
Rattus norvegicus (rat)
Description:
P31652
Residue:
630
  
Inhibitor
Name:
BDBM50061881
Synonyms:
3-[Bis-(4-fluoro-phenyl)-methoxy]-8-cyclopropylmethyl-8-aza-bicyclo[3.2.1]octane | CHEMBL440272
Type:
Small organic molecule
Emp. Form.:
C24H27F2NO
Mol. Mass.:
383.4741
SMILES:
Fc1ccc(cc1)C(OC1CC2CCC(C1)N2CC1CC1)c1ccc(F)cc1
: