Target
Nitric oxide synthase, brain
Ligand
BDBM50062135
Substrate
Meas. Tech.
ChEMBL_143365 (CHEMBL751657)
IC50
1600±n/a nM
Citation
 Webber, RKMetz, SMoore, WMConnor, JRCurrie, MGFok, KFHagen, TJHansen, DWJerome, GMManning, PTPitzele, BSToth, MVTrivedi, MZupec, METjoeng, FS Substituted 2-iminopiperidines as inhibitors of human nitric oxide synthase isoforms. J Med Chem 41:96-101 (1998)  
Target
Name:
Nitric oxide synthase, brain
Synonyms:
Constitutive NOS NC-NOS NOS type I nNOS NOS1_HUMAN Neuronal nitric oxide synthase Nitric oxide synthase, neuronal (nNOS) bNOS | nNOS
Type:
Homodimer
Mol. Mass.:
160985.98
Organism:
Homo sapiens (Human)
Description:
P29475
Residue:
1434
  
Inhibitor
Name:
BDBM50062135
Synonyms:
4-Ethyl-piperidin-(2Z)-ylideneamine | CHEMBL6813
Type:
Small organic molecule
Emp. Form.:
C7H14N2
Mol. Mass.:
126.1995
SMILES:
CCC1CCN=C(N)C1
: