Target
Nitric oxide synthase, inducible
Ligand
BDBM50062135
Substrate
Meas. Tech.
ChEMBL_89200 (CHEMBL701151)
IC50
2600±n/a nM
Citation
 Webber, RKMetz, SMoore, WMConnor, JRCurrie, MGFok, KFHagen, TJHansen, DWJerome, GMManning, PTPitzele, BSToth, MVTrivedi, MZupec, METjoeng, FS Substituted 2-iminopiperidines as inhibitors of human nitric oxide synthase isoforms. J Med Chem 41:96-101 (1998)  
Target
Name:
Nitric oxide synthase, inducible
Synonyms:
HEP-NOS Inducible NO synthase NOS type II NOS2A Nitric oxide synthase, inducible (iNOS) | iNOS
Type:
Homodimer
Mol. Mass.:
131141.95
Organism:
Homo sapiens (Human)
Description:
P35228
Residue:
1153
  
Inhibitor
Name:
BDBM50062135
Synonyms:
4-Ethyl-piperidin-(2Z)-ylideneamine | CHEMBL6813
Type:
Small organic molecule
Emp. Form.:
C7H14N2
Mol. Mass.:
126.1995
SMILES:
CCC1CCN=C(N)C1
: