Target
Nitric oxide synthase, endothelial
Ligand
BDBM50062135
Substrate
Meas. Tech.
ChEMBL_65304 (CHEMBL678078)
IC50
13000±n/a nM
Citation
 Webber, RKMetz, SMoore, WMConnor, JRCurrie, MGFok, KFHagen, TJHansen, DWJerome, GMManning, PTPitzele, BSToth, MVTrivedi, MZupec, METjoeng, FS Substituted 2-iminopiperidines as inhibitors of human nitric oxide synthase isoforms. J Med Chem 41:96-101 (1998)  
Target
Name:
Nitric oxide synthase, endothelial
Synonyms:
Constitutive NOS Endothelial NOS NOS type III NOS3_HUMAN Nitric oxide synthase (inducible and endothelial) Nitric-oxide synthase (endothelial and brain) eNOS
Type:
Enzyme Catalytic Domain
Mol. Mass.:
133297.84
Organism:
Homo sapiens (Human)
Description:
P29474
Residue:
1203
  
Inhibitor
Name:
BDBM50062135
Synonyms:
4-Ethyl-piperidin-(2Z)-ylideneamine | CHEMBL6813
Type:
Small organic molecule
Emp. Form.:
C7H14N2
Mol. Mass.:
126.1995
SMILES:
CCC1CCN=C(N)C1
: