Target
Matrix metalloproteinase-9
Ligand
BDBM50062338
Substrate
Meas. Tech.
ChEMBL_105401 (CHEMBL710820)
Ki
1.7±n/a nM
Citation
 Levy, DELapierre, FLiang, WYe, WLange, CWLi, XGrobelny, DCasabonne, MTyrrell, DHolme, KNadzan, AGalardy, RE Matrix metalloproteinase inhibitors: a structure-activity study. J Med Chem 41:199-223 (1998)  
Target
Name:
Matrix metalloproteinase-9
Synonyms:
67 kDa matrix metalloproteinase-9 92 kDa gelatinase CLG4B Gelatinase B MMP9 Matrix metalloproteinase 9 (MMP-9) Matrix metalloproteinase-9 (MMP9)
Type:
Enzyme
Mol. Mass.:
78452.28
Organism:
Homo sapiens (Human)
Description:
P14780
Residue:
707
  
Inhibitor
Name:
BDBM50062338
Synonyms:
(2R,3S)-2,N*1*-Dihydroxy-N*4*-[(S)-2-(1H-indol-3-yl)-1-methylcarbamoyl-ethyl]-3-isobutyl-succinamide | CHEMBL70571
Type:
Small organic molecule
Emp. Form.:
C20H28N4O5
Mol. Mass.:
404.4601
SMILES:
CNC(=O)[C@H](Cc1c[nH]c2ccccc12)NC(=O)[C@H](CC(C)C)[C@H](O)C(=O)NO
: