Target
cAMP-specific 3',5'-cyclic phosphodiesterase 4B
Ligand
BDBM14361
Substrate
Meas. Tech.
ChEMBL_155043 (CHEMBL764362)
IC50
35.7±n/a nM
Citation
 Kleinman, EFCampbell, EGiordano, LACohan, VLJenkinson, THCheng, JBShirley, JTPettipher, ERSalter, EDHibbs, TADiCapua, FMBordner, J Striking effect of hydroxamic acid substitution on the phosphodiesterase type 4 (PDE4) and TNF alpha inhibitory activity of two series of rolipram analogues: implications for a new active site model of PDE4. J Med Chem 41:266-70 (1998)  
Target
Name:
cAMP-specific 3',5'-cyclic phosphodiesterase 4B
Synonyms:
3',5'-cyclic phosphodiesterase Isoform PDE4B1 PDE4B PDE4B_HUMAN Phosphodiesterase 4B (PDE4B) Phosphodiesterase Type 4 (PDE4B)
Type:
Protein
Mol. Mass.:
83318.87
Organism:
Homo sapiens (Human)
Description:
Q07343
Residue:
736
  
Inhibitor
Name:
BDBM14361
Synonyms:
(R,S)-Rolipram 4-[3-(cyclopentyloxy)-4-methoxyphenyl]pyrrolidin-2-one CHEMBL63 | Rolipram
Type:
Small organic molecule
Emp. Form.:
C16H21NO3
Mol. Mass.:
275.3428
SMILES:
COc1ccc(cc1OC1CCCC1)C1CNC(=O)C1
: