Target
Serine/threonine-protein kinase TBK1
Ligand
BDBM50509049
Substrate
Meas. Tech.
ChEMBL_1837195 (CHEMBL4337328)
EC50
53900±n/a nM
Citation
 Cui, XZhang, RCen, SZhou, J STING modulators: Predictive significance in drug discovery. Eur J Med Chem 182:0 (2019)  
Target
Name:
Serine/threonine-protein kinase TBK1
Synonyms:
NAK Protein cereblon/Serine/threonine-protein kinase TBK1 TANK-binding kinase 1 (TBK-1) TBK1 | TBK1_HUMAN
Type:
protein
Mol. Mass.:
83645.20
Organism:
Homo sapiens (Human)
Description:
Q9UHD2
Residue:
729
  
Inhibitor
Name:
BDBM50509049
Synonyms:
CHEMBL4440744
Type:
Small organic molecule
Emp. Form.:
C34H38N12O4
Mol. Mass.:
678.7435
SMILES:
CCn1nc(C)cc1C(=O)\N=c1/[nH]c2cc(ccc2n1CCCCn1c2ccc(cc2[nH]\c1=N/C(=O)c1cc(C)nn1CC)C(N)=O)C(N)=O
: