Target
Metabotropic glutamate receptor 2
Ligand
BDBM50408696
Substrate
Meas. Tech.
ChEMBL_106035 (CHEMBL717203)
IC50
190±n/a nM
Citation
 Ornstein, PLBleisch, TJArnold, MBKennedy, JHWright, RAJohnson, BGTizzano, JPHelton, DRKallman, MJSchoepp, DDHérin, M 2-substituted (2SR)-2-amino-2-((1SR,2SR)-2-carboxycycloprop-1-yl)glycines as potent and selective antagonists of group II metabotropic glutamate receptors. 2. Effects of aromatic substitution, pharmacological characterization, and bioavailability. J Med Chem 41:358-78 (1998)  
Target
Name:
Metabotropic glutamate receptor 2
Synonyms:
GPRC1B GRM2_HUMAN Metabotropic glutamate receptor mGlu2 | metabotropic glutamate 2
Type:
Enzyme
Mol. Mass.:
95584.88
Organism:
Homo sapiens (Human)
Description:
Q14416
Residue:
872
  
Inhibitor
Name:
BDBM50408696
Synonyms:
CHEMBL2111822
Type:
Small organic molecule
Emp. Form.:
C15H19NO6S
Mol. Mass.:
341.379
SMILES:
CS(=O)(=O)c1cccc(CC[C@@](N)(C2C[C@@H]2C(O)=O)C(O)=O)c1
: