Target
Metabotropic glutamate receptor 3
Ligand
BDBM50408696
Substrate
Meas. Tech.
ChEMBL_106376 (CHEMBL718350)
IC50
180±n/a nM
Citation
 Ornstein, PLBleisch, TJArnold, MBKennedy, JHWright, RAJohnson, BGTizzano, JPHelton, DRKallman, MJSchoepp, DDHérin, M 2-substituted (2SR)-2-amino-2-((1SR,2SR)-2-carboxycycloprop-1-yl)glycines as potent and selective antagonists of group II metabotropic glutamate receptors. 2. Effects of aromatic substitution, pharmacological characterization, and bioavailability. J Med Chem 41:358-78 (1998)  
Target
Name:
Metabotropic glutamate receptor 3
Synonyms:
GPRC1C GRM3_HUMAN metabotropic glutamate 3 metabotropic glutamate 3/1c
Type:
Enzyme Catalytic Domain
Mol. Mass.:
98889.09
Organism:
Homo sapiens (Human)
Description:
metabotropic glutamate 1c 0 HUMAN::Q14832
Residue:
879
  
Inhibitor
Name:
BDBM50408696
Synonyms:
CHEMBL2111822
Type:
Small organic molecule
Emp. Form.:
C15H19NO6S
Mol. Mass.:
341.379
SMILES:
CS(=O)(=O)c1cccc(CC[C@@](N)(C2C[C@@H]2C(O)=O)C(O)=O)c1
: