Target
Histone deacetylase (HDAC1 and HDAC2)
Ligand
BDBM27187
Substrate
Meas. Tech.
ChEMBL_1837437 (CHEMBL4337570)
IC50
4.1±n/a nM
Citation
 Janas, APrzybylski, P 14- and 15-membered lactone macrolides and their analogues and hybrids: structure, molecular mechanism of action and biological activity. Eur J Med Chem 182:0 (2019)  
Target
Name:
Histone deacetylase (HDAC1 and HDAC2)
Synonyms:
HDACs | Histone deacetylase 1/2
Type:
Mol. Mass.:
Description:
ASSAY_ID of ChEMBL is 2197604
Components:
This complex has 2 components.
Component 1
Name:
Histone deacetylase 1
Synonyms:
Cereblon/Histone deacetylase 1 HDAC1 Histone deacetylase 1 (HDAC1) RPD3L1
Type:
Enzyme
Mol. Mass.:
55090.27
Organism:
Homo sapiens (Human)
Description:
Q13547
Residue:
482
  
Component 2
Name:
Histone deacetylase 2
Synonyms:
Cereblon/Histone deacetylase 2 HDAC2 Histone deacetylase 2 (HDAC2) | Human HDAC2
Type:
Chromatin regulator; hydrolase; repressor
Mol. Mass.:
55356.54
Organism:
Homo sapiens (Human)
Description:
Q92769
Residue:
488
  
Inhibitor
Name:
BDBM27187
Synonyms:
triazole-linked clarithromycin-based compound, 24c
Type:
Emp. Form.:
C53H87N5O15
Mol. Mass.:
1034.2824
SMILES:
CC[C@H]1OC(=O)[C@H](C)[C@@H](O[C@H]2C[C@@](C)(OC)[C@@H](O)[C@H](C)O2)[C@H](C)[C@@H](O[C@@H]2O[C@H](C)C[C@@H]([C@H]2O)N(C)Cc2ccc(cc2)-c2cn(CCCCCCC(=O)NO)nn2)[C@@](C)(C[C@@H](C)C(=O)[C@H](C)[C@@H](O)[C@]1(C)O)OC
: