Target
Adenosine receptor A1
Ligand
BDBM50062857
Substrate
Meas. Tech.
ChEMBL_29122 (CHEMBL642256)
Ki
1.23±n/a nM
Citation
 Holschbach, MHFein, TKrummeich, CLewis, RGWutz, WSchwabe, UUnterlugauer, DOlsson, RA A1 adenosine receptor antagonists as ligands for positron emission tomography (PET) and single-photon emission tomography (SPET). J Med Chem 41:555-63 (1998)  
Target
Name:
Adenosine receptor A1
Synonyms:
AA1R_BOVIN ADENOSINE A1 high ADORA1 | Adenosine A1 receptor
Type:
Enzyme Catalytic Domain
Mol. Mass.:
36602.99
Organism:
BOVINE
Description:
ADENOSINE 0 BOVINE::P28190
Residue:
326
  
Inhibitor
Name:
BDBM50062857
Synonyms:
8-Cyclopentyl-1-(2-fluoro-propyl)-3-propyl-3,7-dihydro-purine-2,6-dione | CHEMBL346676
Type:
Small organic molecule
Emp. Form.:
C16H23FN4O2
Mol. Mass.:
322.3778
SMILES:
CCCn1c2nc([nH]c2c(=O)n(CC(C)F)c1=O)C1CCCC1
: