Target
Galectin-7
Ligand
BDBM50509533
Substrate
Meas. Tech.
ChEMBL_1838659 (CHEMBL4338792)
Kd
36000±n/a nM
Citation
 Mahanti, MPal, KBSundin, APLeffler, HNilsson, UJ Epimers Switch Galectin-9 Domain Selectivity: 3 ACS Med Chem Lett 11:34-39 (2020)  
Target
Name:
Galectin-7
Synonyms:
Gal-7 LEG7_HUMAN PI7 p53-induced gene 1 protein
Type:
Galactoside-binding protein
Mol. Mass.:
15077.89
Organism:
Homo sapiens (Human)
Description:
Residue:
136
  
Inhibitor
Name:
BDBM50509533
Synonyms:
CHEMBL4557916
Type:
Small organic molecule
Emp. Form.:
C19H21Cl2NO5S
Mol. Mass.:
446.345
SMILES:
COc1cccc(N[C@H]2[C@@H](O)[C@@H](CO)O[C@H](Sc3ccc(Cl)c(Cl)c3)[C@@H]2O)c1
: