Target
Histone deacetylase 11
Ligand
BDBM29589
Substrate
Meas. Tech.
ChEMBL_1839062 (CHEMBL4339277)
IC50
1.6±n/a nM
Citation
 Luan, YLi, JBernatchez, JALi, R Kinase and Histone Deacetylase Hybrid Inhibitors for Cancer Therapy. J Med Chem 62:3171-3183 (2019)  
Target
Name:
Histone deacetylase 11
Synonyms:
HD11 HDAC11 | Human HDAC11
Type:
Chromatin regulator; hydrolase; repressor
Mol. Mass.:
39187.66
Organism:
Homo sapiens (Human)
Description:
Q96DB2
Residue:
347
  
Inhibitor
Name:
BDBM29589
Synonyms:
Faridak LBH-589B US10722597, Compound Panobinostat
Type:
Small organic molecule
Emp. Form.:
C21H23N3O2
Mol. Mass.:
349.4262
SMILES:
Cc1[nH]c2ccccc2c1CCNCc1ccc(\C=C\C(=O)NO)cc1
: