Target
Prostaglandin G/H synthase 1
Ligand
BDBM50063781
Substrate
Meas. Tech.
ChEMBL_158940 (CHEMBL767828)
IC50
95±n/a nM
Citation
 Janusz, JMYoung, PAScherz, MWEnzweiler, KWu, LIGan, LPikul, SMcDow-Dunham, KLJohnson, CRSenanayake, CBKellstein, DEGreen, SATulich, JLRosario-Jansen, TMagrisso, IJWehmeyer, KRKuhlenbeck, DLEichhold, THDobson, RL New cyclooxygenase-2/5-lipoxygenase inhibitors. 2. 7-tert-butyl-2,3-dihydro-3,3-dimethylbenzofuran derivatives as gastrointestinal safe antiinflammatory and analgesic agents: variations of the dihydrobenzofuran ring. J Med Chem 41:1124-37 (1998)  
Target
Name:
Prostaglandin G/H synthase 1
Synonyms:
COX-1 Cyclooxygenase Cyclooxygenase-1 (COX-1) PTGS1 | Prostaglandin G/H synthase (cyclooxygenase)
Type:
Enzyme
Mol. Mass.:
68692.62
Organism:
Homo sapiens (Human)
Description:
P23219
Residue:
599
  
Inhibitor
Name:
BDBM50063781
Synonyms:
1-(7-tert-Butyl-3,3-dimethyl-2,3-dihydro-benzofuran-5-yl)-butan-1-one CHEMBL13980
Type:
Small organic molecule
Emp. Form.:
C18H26O2
Mol. Mass.:
274.3978
SMILES:
CCCC(=O)c1cc2c(OCC2(C)C)c(c1)C(C)(C)C
: