Target
Prostaglandin G/H synthase 2
Ligand
BDBM50063779
Substrate
Meas. Tech.
ChEMBL_157496 (CHEMBL765812)
IC50
40±n/a nM
Citation
 Janusz, JMYoung, PAScherz, MWEnzweiler, KWu, LIGan, LPikul, SMcDow-Dunham, KLJohnson, CRSenanayake, CBKellstein, DEGreen, SATulich, JLRosario-Jansen, TMagrisso, IJWehmeyer, KRKuhlenbeck, DLEichhold, THDobson, RL New cyclooxygenase-2/5-lipoxygenase inhibitors. 2. 7-tert-butyl-2,3-dihydro-3,3-dimethylbenzofuran derivatives as gastrointestinal safe antiinflammatory and analgesic agents: variations of the dihydrobenzofuran ring. J Med Chem 41:1124-37 (1998)  
Target
Name:
Prostaglandin G/H synthase 2
Synonyms:
COX2 Cyclooxygenase 2 (COX-2) Cyclooxygenase-2 (COX-2 AA) Cyclooxygenase-2 (COX-2) PGH2_HUMAN PHS II Prostaglandin E synthase/G/H synthase 2 Prostaglandin-endoperoxide synthase 2
Type:
Enzyme
Mol. Mass.:
69003.89
Organism:
Homo sapiens (Human)
Description:
Recombinant Cox-2 provided by Cayman (Cayman Chemical Co.,Ann Arbor, MI).
Residue:
604
  
Inhibitor
Name:
BDBM50063779
Synonyms:
1-(7-tert-Butyl-3,3-dimethyl-2,3-dihydro-benzofuran-5-yl)-pentan-1-one | CHEMBL13661
Type:
Small organic molecule
Emp. Form.:
C19H28O2
Mol. Mass.:
288.4244
SMILES:
CCCCC(=O)c1cc2c(OCC2(C)C)c(c1)C(C)(C)C
: