Target
Oxysterols receptor LXR-beta
Ligand
BDBM19993
Substrate
Meas. Tech.
ChEMBL_1839625 (CHEMBL4339840)
EC50
30±n/a nM
Citation
 Saida-Tamiya, KTamiya, MSekiya, GIsobe, KKitazawa, TIsaka, NMatsukawa, AKawahara, KKomuro, AIshiguro, M Structural requirements of cholenamide derivatives as the LXR ligands. Bioorg Med Chem Lett 29:1330-1335 (2019)  
Target
Name:
Oxysterols receptor LXR-beta
Synonyms:
Liver X receptor beta NR1H2_RAT Nuclear receptor subfamily 1 group H member 2 Oxysterols receptor LXR-beta | Ubiquitously-expressed nuclear receptor
Type:
PROTEIN
Mol. Mass.:
49742.14
Organism:
Rattus norvegicus
Description:
ChEMBL_117390
Residue:
446
  
Inhibitor
Name:
BDBM19993
Synonyms:
CHEMBL62136 T 0901317 TO-901317 US10669296, Compound TO901317 [3H]T0901317
Type:
Small organic molecule
Emp. Form.:
C17H12F9NO3S
Mol. Mass.:
481.333
SMILES:
OC(c1ccc(cc1)N(CC(F)(F)F)S(=O)(=O)c1ccccc1)(C(F)(F)F)C(F)(F)F
: