Target
Ephrin type-A receptor 1
Ligand
BDBM50509949
Substrate
Meas. Tech.
ChEMBL_1839778 (CHEMBL4339993)
IC50
>10000±n/a nM
Citation
 Sun, CFang, LZhang, XGao, PGou, S Novel 7-formyl-naphthyridyl-ureas derivatives as potential selective FGFR4 inhibitors: Design, synthesis, and biological activity studies. Bioorg Med Chem 27:1932-1941 (2019)  
Target
Name:
Ephrin type-A receptor 1
Synonyms:
EPH EPH tyrosine kinase 1 EPHA1_HUMAN EPHT1 Ephrin type-A receptor 1 Erythropoietin-producing hepatoma receptor hEpha1
Type:
Enzyme
Mol. Mass.:
108128.04
Organism:
Homo sapiens (Human)
Description:
P21709
Residue:
976
  
Inhibitor
Name:
BDBM50509949
Synonyms:
CHEMBL4475216 | US11667631, Example 29
Type:
Small organic molecule
Emp. Form.:
C26H31N7O5
Mol. Mass.:
521.5682
SMILES:
COC[C@@H](C)Nc1cc(NC(=O)N2CCCc3cc(CN4CCCCOC4=O)c(C=O)nc23)ncc1C#N
: