Target
Prolyl 3-hydroxylase OGFOD1
Ligand
BDBM107704
Substrate
Meas. Tech.
ChEMBL_1840412 (CHEMBL4340711)
IC50
1400±n/a nM
Citation
 Langley, GWAbboud, MILohans, CTSchofield, CJ Inhibition of a viral prolyl hydroxylase. Bioorg Med Chem 27:2405-2412 (2019)  
Target
Name:
Prolyl 3-hydroxylase OGFOD1
Synonyms:
1.14.11.- KIAA1612 OGFOD1 TPA1 uS12 prolyl 3-hydroxylase
Type:
PROTEIN
Mol. Mass.:
63220.24
Organism:
Homo sapiens
Description:
ChEMBL_119148
Residue:
542
  
Inhibitor
Name:
BDBM107704
Synonyms:
US11426393, Compound Table XV.11 US8598210, Table XV, 10 US8722895, 10: {[5-(3-Chlorophenyl)-3-hydroxypyridine-2- carbonyl]amino}-acetic acid trifluoroacetic acid salt US9598370, Example 00136 | USRE47437, Example {[5-(3-Chlorophenyl)-3-hydroxypyridine-2-carbonyl]amino}-acetic acid
Type:
Small organic molecule
Emp. Form.:
C14H11ClN2O4
Mol. Mass.:
306.701
SMILES:
OC(=O)CNC(=O)c1ncc(cc1O)-c1cccc(Cl)c1
: