Target
5-hydroxytryptamine receptor 2A
Ligand
BDBM50064579
Substrate
Meas. Tech.
ChEMBL_2256 (CHEMBL617199)
IC50
200±n/a nM
Citation
 Taverne, TDiouf, ODepreux, PPoupaert, JHLesieur, DGuardiola-Lemaître, BRenard, PRettori, MCCaignard, DHPfeiffer, B Novel benzothiazolin-2-one and benzoxazin-3-one arylpiperazine derivatives with mixed 5HT1A/D2 affinity as potential atypical antipsychotics. J Med Chem 41:2010-8 (1998)  
Target
Name:
5-hydroxytryptamine receptor 2A
Synonyms:
5-HT2A 5HTR2A Serotonin 2a (5-HT2a) receptor
Type:
Enzyme Catalytic Domain
Mol. Mass.:
52578.24
Organism:
BOVINE
Description:
5-HT2A HTR2A BOVINE::Q75Z89
Residue:
470
  
Inhibitor
Name:
BDBM50064579
Synonyms:
6-{2-[4-(4-Fluoro-phenyl)-piperazin-1-yl]-ethyl}-3-methyl-3H-benzothiazol-2-one | CHEMBL60318
Type:
Small organic molecule
Emp. Form.:
C20H22FN3OS
Mol. Mass.:
371.472
SMILES:
Cn1c2ccc(CCN3CCN(CC3)c3ccc(F)cc3)cc2sc1=O
: