Target
5-hydroxytryptamine receptor 2A
Ligand
BDBM50064581
Substrate
Meas. Tech.
ChEMBL_2256 (CHEMBL617199)
IC50
400±n/a nM
Citation
 Taverne, TDiouf, ODepreux, PPoupaert, JHLesieur, DGuardiola-Lemaître, BRenard, PRettori, MCCaignard, DHPfeiffer, B Novel benzothiazolin-2-one and benzoxazin-3-one arylpiperazine derivatives with mixed 5HT1A/D2 affinity as potential atypical antipsychotics. J Med Chem 41:2010-8 (1998)  
Target
Name:
5-hydroxytryptamine receptor 2A
Synonyms:
5-HT2A 5HTR2A Serotonin 2a (5-HT2a) receptor
Type:
Enzyme Catalytic Domain
Mol. Mass.:
52578.24
Organism:
BOVINE
Description:
5-HT2A HTR2A BOVINE::Q75Z89
Residue:
470
  
Inhibitor
Name:
BDBM50064581
Synonyms:
3-Methyl-6-{4-[4-(3-trifluoromethyl-phenyl)-piperazin-1-yl]-butyl}-3H-benzothiazol-2-one | CHEMBL61818
Type:
Small organic molecule
Emp. Form.:
C23H26F3N3OS
Mol. Mass.:
449.532
SMILES:
Cn1c2ccc(CCCCN3CCN(CC3)c3cccc(c3)C(F)(F)F)cc2sc1=O
: