Target
D(4) dopamine receptor
Ligand
BDBM50051562
Substrate
Meas. Tech.
ChEMBL_60826 (CHEMBL675815)
Ki
2.4±n/a nM
Citation
 Ennis, MDGhazal, NBHoffman, RLSmith, MWSchlachter, SKLawson, CFIm, WBPregenzer, JFSvensson, KALewis, RAHall, EDSutter, DMHarris, LTMcCall, RB Isochroman-6-carboxamides as highly selective 5-HT1D agonists: potential new treatment for migraine without cardiovascular side effects. J Med Chem 41:2180-3 (1998)  
Target
Name:
D(4) dopamine receptor
Synonyms:
D(2C) dopamine receptor DOPAMINE D4.2 DRD4 Dopamine D4 receptor
Type:
Enzyme
Mol. Mass.:
48373.19
Organism:
Homo sapiens (Human)
Description:
P21917
Residue:
419
  
Inhibitor
Name:
BDBM50051562
Synonyms:
1-(2-Isochroman-1-yl-ethyl)-4-(4-methoxy-phenyl)-piperazine | CHEMBL71724
Type:
Small organic molecule
Emp. Form.:
C22H28N2O2
Mol. Mass.:
352.4699
SMILES:
COc1ccc(cc1)N1CCN(CCC2OCCc3ccccc23)CC1
: