Target
Sigma non-opioid intracellular receptor 1
Ligand
BDBM50064954
Substrate
Meas. Tech.
ChEMBL_200965 (CHEMBL802053)
Ki
3.87±n/a nM
Citation
 Huang, YHammond, PSWhirrett, BRKuhner, RJWu, LChilders, SRMach, RH Synthesis and quantitative structure-activity relationships of N-(1-benzylpiperidin-4-yl)phenylacetamides and related analogues as potent and selective sigma1 receptor ligands. J Med Chem 41:2361-70 (1998)  
Target
Name:
Sigma non-opioid intracellular receptor 1
Synonyms:
Aging-associated gene 8 protein SGMR1_HUMAN SIGMAR1 SR31747-binding protein Sigma 1-type opioid receptor Sigma1R | hSigmaR1
Type:
Enzyme Catalytic Domain
Mol. Mass.:
25124.85
Organism:
Homo sapiens (Human)
Description:
Q99720
Residue:
223
  
Inhibitor
Name:
BDBM50064954
Synonyms:
CHEMBL76547 | N-(1-Benzyl-piperidin-4-yl)-2-(2,4-difluoro-phenyl)-acetamide
Type:
Small organic molecule
Emp. Form.:
C20H22F2N2O
Mol. Mass.:
344.3983
SMILES:
Fc1ccc(CC(=O)NC2CCN(Cc3ccccc3)CC2)c(F)c1
: