Target
Glycine receptor subunit alpha-1
Ligand
BDBM50225707
Substrate
Meas. Tech.
ChEMBL_1842072 (CHEMBL4342371)
IC50
51±n/a nM
Citation
 Zlotos, DPMohsen, AMYMandour, YMMarzouk, MABreitinger, UVillmann, CBreitinger, HGSotriffer, CJensen, AAHolzgrabe, U 11-Aminostrychnine and  J Nat Prod 82:2332-2336 (2019)  
Target
Name:
Glycine receptor subunit alpha-1
Synonyms:
GLRA1 Glycine receptor 48 kDa subunit | Glycine receptor strychnine-binding subunit
Type:
Enzyme Catalytic Domain
Mol. Mass.:
52635.39
Organism:
Homo sapiens (Human)
Description:
P23415
Residue:
457
  
Inhibitor
Name:
BDBM50225707
Synonyms:
CHEBI:28973 | Strychnine
Type:
Small organic molecule
Emp. Form.:
C21H22N2O2
Mol. Mass.:
334.4116
SMILES:
[H][C@]12C[C@@]3([H])C4=CCO[C@@]5([H])CC(=O)N6c7ccccc7[C@@]1(CCN2C4)[C@]6([H])[C@@]35[H]
: