Target
Vasopressin V1a receptor
Ligand
BDBM50065116
Substrate
Meas. Tech.
ChEMBL_215167 (CHEMBL821340)
IC50
25±n/a nM
Citation
 Albright, JDReich, MFDelos Santos, EGDusza, JPSum, FWVenkatesan, AMCoupet, JChan, PSRu, XMazandarani, HBailey, T 5-Fluoro-2-methyl-N-[4-(5H-pyrrolo[2,1-c]-[1, 4]benzodiazepin-10(11H)-ylcarbonyl)-3-chlorophenyl]benzamide (VPA-985): an orally active arginine vasopressin antagonist with selectivity for V2 receptors. J Med Chem 41:2442-4 (1998)  
Target
Name:
Vasopressin V1a receptor
Synonyms:
AVPR V1a AVPR1A V1AR_HUMAN VASOPRESSIN V1A Vasopressin V1 receptor Vasopressin receptor
Type:
Receptor
Mol. Mass.:
46820.18
Organism:
Homo sapiens (Human)
Description:
P37288
Residue:
418
  
Inhibitor
Name:
BDBM50065116
Synonyms:
CHEMBL81755 | N-[4-(5H,11H-Benzo[e]pyrrolo[1,2-a][1,4]diazepine-10-carbonyl)-2-chloro-phenyl]-5-fluoro-2-methyl-benzamide
Type:
Small organic molecule
Emp. Form.:
C27H21ClFN3O2
Mol. Mass.:
473.926
SMILES:
Cc1ccc(F)cc1C(=O)Nc1ccc(cc1Cl)C(=O)N1Cc2cccn2Cc2ccccc12
: