Target
Vascular endothelial growth factor receptor 2
Ligand
BDBM21
Substrate
Meas. Tech.
ChEMBL_1842459 (CHEMBL4342886)
IC50
50±n/a nM
Citation
 Das, DHong, J Recent advancements of 4-aminoquinazoline derivatives as kinase inhibitors and their applications in medicinal chemistry. Eur J Med Chem 170:55-72 (2019)  
Target
Name:
Vascular endothelial growth factor receptor 2
Synonyms:
CD_antigen=CD309 Fetal liver kinase 1 (FLK-1) KDR Protein-tyrosine kinase receptor Flk-1 VEGFR-2 VEGFR2 Vascular Endothelial Growth Factor Receptor Kinase 2 Vascular endothelial growth factor receptor 2 (KDR) Vascular endothelial growth factor receptor 2 (VEGFR2) Vascular endothelial growth factor receptor-2 (VEGFR-2)
Type:
Receptor Tyrosine Kinase
Mol. Mass.:
151510.97
Organism:
Homo sapiens (Human)
Description:
P35968
Residue:
1356
  
Inhibitor
Name:
BDBM21
Synonyms:
CHEMBL24828 VANDETANIB ZD6474 | cid_3081361
Type:
Emp. Form.:
C22H24BrFN4O2
Mol. Mass.:
475.354
SMILES:
COc1cc2c(Nc3ccc(Br)cc3F)ncnc2cc1OCC1CCN(C)CC1
: