Target
5-hydroxytryptamine receptor 1D
Ligand
BDBM50060429
Substrate
Meas. Tech.
ChEMBL_42200 (CHEMBL658301)
EC50
1.1±n/a nM
Citation
 Castro, JLCollins, IRussell, MGWatt, APSohal, BRathbone, DBeer, MSStanton, JA Enhancement of oral absorption in selective 5-HT1D receptor agonists: fluorinated 3-[3-(piperidin-1-yl)propyl]indoles. J Med Chem 41:2667-70 (1998)  
Target
Name:
5-hydroxytryptamine receptor 1D
Synonyms:
5-HT-1D 5-HT1D 5HT1D_HUMAN HTR1DA Serotonin (5-HT) receptor | Serotonin Receptor 1D
Type:
G Protein-Coupled Receptor (GPCR)
Mol. Mass.:
41920.63
Organism:
Homo sapiens (Human)
Description:
Receptor binding assays were performed using human clone stably expressed in CHO cells.
Residue:
377
  
Inhibitor
Name:
BDBM50060429
Synonyms:
(R)-2-(4-Fluoro-phenyl)-2-{1-[3-(5-[1,2,4]triazol-4-yl-1H-indol-3-yl)-propyl]-piperidin-4-ylamino}-ethanol | CHEMBL313714
Type:
Small organic molecule
Emp. Form.:
C26H31FN6O
Mol. Mass.:
462.5623
SMILES:
OC[C@H](NC1CCN(CCCc2c[nH]c3ccc(cc23)-n2cnnc2)CC1)c1ccc(F)cc1
: