Target
Genome polyprotein
Ligand
BDBM50065586
Substrate
Meas. Tech.
ChEMBL_160898 (CHEMBL771794)
Ki
7±n/a nM
Citation
 Webber, SEOkano, KLittle, TLReich, SHXin, YFuhrman, SAMatthews, DALove, RAHendrickson, TFPatick, AKMeador, JWFerre, RABrown, ELFord, CEBinford, SLWorland, ST Tripeptide aldehyde inhibitors of human rhinovirus 3C protease: design, synthesis, biological evaluation, and cocrystal structure solution of P1 glutamine isosteric replacements. J Med Chem 41:2786-805 (1998)  
Target
Name:
Genome polyprotein
Synonyms:
Human rhinovirus A protease | Human rhinovirus B 3A protease
Type:
PROTEIN
Mol. Mass.:
44361.04
Organism:
Human rhinovirus B
Description:
ChEMBL_158953
Residue:
401
  
Inhibitor
Name:
BDBM50065586
Synonyms:
((S)-3-Methyl-1-{(S)-1-[(S)-2-oxo-1-(propionylamino-methyl)-ethylcarbamoyl]-2-phenyl-ethylcarbamoyl}-butyl)-carbamic acid benzyl ester | CHEMBL95003
Type:
Small organic molecule
Emp. Form.:
C29H38N4O6
Mol. Mass.:
538.6352
SMILES:
CCC(=O)NC[C@H](NC(=O)[C@H](Cc1ccccc1)NC(=O)[C@H](CC(C)C)NC(=O)OCc1ccccc1)C=O
: