Target
Genome polyprotein
Ligand
BDBM50065621
Substrate
Meas. Tech.
ChEMBL_160902 (CHEMBL771798)
Ki
30±n/a nM
Citation
 Dragovich, PSWebber, SEBabine, REFuhrman, SAPatick, AKMatthews, DALee, CAReich, SHPrins, TJMarakovits, JTLittlefield, ESZhou, RTikhe, JFord, CEWallace, MBMeador, JWFerre, RABrown, ELBinford, SLHarr, JEDeLisle, DMWorland, ST Structure-based design, synthesis, and biological evaluation of irreversible human rhinovirus 3C protease inhibitors. 1. Michael acceptor structure-activity studies. J Med Chem 41:2806-18 (1998)  
Target
Name:
Genome polyprotein
Synonyms:
Human rhinovirus A protease | Human rhinovirus B 3A protease
Type:
PROTEIN
Mol. Mass.:
44361.04
Organism:
Human rhinovirus B
Description:
ChEMBL_158953
Residue:
401
  
Inhibitor
Name:
BDBM50065621
Synonyms:
CHEMBL94688 | [(S)-1-((S)-1-{(S)-3-Carbamoyl-1-[2-oxo-dihydro-pyran-(3E)-ylidenemethyl]-propylcarbamoyl}-2-phenyl-ethylcarbamoyl)-3-methyl-butyl]-carbamic acid benzyl ester
Type:
Small organic molecule
Emp. Form.:
C33H42N4O7
Mol. Mass.:
606.7092
SMILES:
CC(C)C[C@H](NC(=O)OCc1ccccc1)C(=O)N[C@@H](Cc1ccccc1)C(=O)N[C@@H](CCC(N)=O)\C=C1/CCCOC1=O
: