Target
Kappa-type opioid receptor
Ligand
BDBM50511257
Substrate
Meas. Tech.
ChEMBL_1844335 (CHEMBL4344762)
Kd
4.8±n/a nM
Citation
 Drakopoulos, AKoszegi, ZLanoiselée, YHübner, HGmeiner, PCalebiro, DDecker, M Investigation of Inactive-State ? Opioid Receptor Homodimerization via Single-Molecule Microscopy Using New Antagonistic Fluorescent Probes. J Med Chem 63:3596-3609 (2020)  
Target
Name:
Kappa-type opioid receptor
Synonyms:
K-OR-1 Kappa-opioid receptor (KOR) Kappa-type opioid receptor (KOR) OPIATE Kappa OPRK1 kappa opioid receptor (KOR)
Type:
G Protein-Coupled Receptor (GPCR)
Mol. Mass.:
42648.76
Organism:
Homo sapiens (Human)
Description:
P41145
Residue:
380
  
Inhibitor
Name:
BDBM50511257
Synonyms:
CHEMBL4577693
Type:
Small organic molecule
Emp. Form.:
C70H84N12O14S2
Mol. Mass.:
1381.618
SMILES:
[H][C@@]12Oc3c4c(C[C@@]5([H])N(CC6CC6)CC[C@@]14[C@@]5(O)Cc1c2[nH]c2ccc(NC(=N)NCCCNC(=O)CNC(=O)CNC(=O)CNC(=O)CNC(=O)CCCCC[N+]4=C(\C=C\C=C\C=C5\N(C)c6ccc(cc6C5(C)C)S(O)(=O)=O)C(C)(C)c5cc(ccc45)S([O-])(=O)=O)cc12)ccc3O
: