Target
Phosphatidylinositol 3,4,5-trisphosphate 5-phosphatase 2
Ligand
BDBM50511342
Substrate
Meas. Tech.
ChEMBL_1844620 (CHEMBL4345047)
IC50
1020±n/a nM
Citation
 White, GPrior, CMills, SJBaker, KWhitfield, HRiley, AMOganesyan, VSPotter, BVLBrearley, CA Regioisomeric Family of Novel Fluorescent Substrates for SHIP2. ACS Med Chem Lett 11:309-315 (2020)  
Target
Name:
Phosphatidylinositol 3,4,5-trisphosphate 5-phosphatase 2
Synonyms:
INPPL-1 Inositol polyphosphate phosphatase-like protein 1 Protein 51C SHIP-2 SHIP2_HUMAN | Src homology-2 domain containing protein tyrosine phosphatase-2 (SHP2)
Type:
Enzyme
Mol. Mass.:
138596.65
Organism:
Homo sapiens (Human)
Description:
O15357
Residue:
1258
  
Inhibitor
Name:
BDBM50511342
Synonyms:
CHEMBL4538474
Type:
Small organic molecule
Emp. Form.:
C6H10O16P4
Mol. Mass.:
462.029
SMILES:
OP(O)(=O)Oc1cc(OP(O)(O)=O)c(OP(O)(O)=O)cc1OP(O)(O)=O
: