Target
Nuclear receptor subfamily 5 group A member 2
Ligand
BDBM50511470
Substrate
Meas. Tech.
ChEMBL_1844860 (CHEMBL4345287)
Ki
7000±n/a nM
Citation
 D'Agostino, EHFlynn, ARCornelison, JLMays, SGPatel, AJui, NTOrtlund, EA Development of a Versatile and Sensitive Direct Ligand Binding Assay for Human NR5A Nuclear Receptors. ACS Med Chem Lett 11:365-370 (2020)  
Target
Name:
Nuclear receptor subfamily 5 group A member 2
Synonyms:
Alpha-1-fetoprotein transcription factor B1F CYP7A promoter-binding factor Hepatocytic transcription factor Liver Receptor Homolog 1 NR5A2_HUMAN hB1F | nuclear receptor subfamily 5 group A member 2 isoform 2
Type:
Nuclear Hormone Receptor
Mol. Mass.:
61341.37
Organism:
Homo sapiens (Human)
Description:
Residue:
541
  
Inhibitor
Name:
BDBM50511470
Synonyms:
CHEMBL4448429
Type:
Small organic molecule
Emp. Form.:
C19H31NO2
Mol. Mass.:
305.4549
SMILES:
CCCCNC(=O)c1cc(cc(c1O)C(C)(C)C)C(C)(C)C
: