Target
Prostaglandin G/H synthase 1
Ligand
BDBM50066569
Substrate
Meas. Tech.
ChEMBL_158915 (CHEMBL763480)
IC50
35±n/a nM
Citation
 Janusz, JMYoung, PARidgeway, JMScherz, MWEnzweiler, KWu, LIGan, LChen, JKellstein, DEGreen, SATulich, JLRosario-Jansen, TMagrisso, IJWehmeyer, KRKuhlenbeck, DLEichhold, THDobson, RL New cyclooxygenase-2/5-lipoxygenase inhibitors. 3. 7-tert-butyl-2, 3-dihydro-3,3-dimethylbenzofuran derivatives as gastrointestinal safe antiinflammatory and analgesic agents: variations at the 5 position. J Med Chem 41:3515-29 (1998)  
Target
Name:
Prostaglandin G/H synthase 1
Synonyms:
COX-1 Cyclooxygenase Cyclooxygenase-1 (COX-1) PTGS1 | Prostaglandin G/H synthase (cyclooxygenase)
Type:
Enzyme
Mol. Mass.:
68692.62
Organism:
Homo sapiens (Human)
Description:
P23219
Residue:
599
  
Inhibitor
Name:
BDBM50066569
Synonyms:
(7-tert-Butyl-3,3-dimethyl-2,3-dihydro-benzofuran-5-yl)-(1-methyl-1H-pyrrol-2-yl)-methanone | CHEMBL119720
Type:
Small organic molecule
Emp. Form.:
C20H25NO2
Mol. Mass.:
311.418
SMILES:
Cn1cccc1C(=O)c1cc2c(OCC2(C)C)c(c1)C(C)(C)C
: