Target
Prostaglandin G/H synthase 1
Ligand
BDBM50066561
Substrate
Meas. Tech.
ChEMBL_158915 (CHEMBL763480)
IC50
20±n/a nM
Citation
 Janusz, JMYoung, PARidgeway, JMScherz, MWEnzweiler, KWu, LIGan, LChen, JKellstein, DEGreen, SATulich, JLRosario-Jansen, TMagrisso, IJWehmeyer, KRKuhlenbeck, DLEichhold, THDobson, RL New cyclooxygenase-2/5-lipoxygenase inhibitors. 3. 7-tert-butyl-2, 3-dihydro-3,3-dimethylbenzofuran derivatives as gastrointestinal safe antiinflammatory and analgesic agents: variations at the 5 position. J Med Chem 41:3515-29 (1998)  
Target
Name:
Prostaglandin G/H synthase 1
Synonyms:
COX-1 Cyclooxygenase Cyclooxygenase-1 (COX-1) PTGS1 | Prostaglandin G/H synthase (cyclooxygenase)
Type:
Enzyme
Mol. Mass.:
68692.62
Organism:
Homo sapiens (Human)
Description:
P23219
Residue:
599
  
Inhibitor
Name:
BDBM50066561
Synonyms:
7-tert-Butyl-3,3-dimethyl-5-((Z)-2-thiophen-2-yl-vinyl)-2,3-dihydro-benzofuran | CHEMBL117911
Type:
Small organic molecule
Emp. Form.:
C20H24OS
Mol. Mass.:
312.469
SMILES:
CC(C)(C)c1cc(\C=C/c2cccs2)cc2c1OCC2(C)C
: