Target
Prostaglandin G/H synthase 2
Ligand
BDBM50408442
Substrate
Meas. Tech.
ChEMBL_159908 (CHEMBL768957)
IC50
3.5±n/a nM
Citation
 Janusz, JMYoung, PARidgeway, JMScherz, MWEnzweiler, KWu, LIGan, LChen, JKellstein, DEGreen, SATulich, JLRosario-Jansen, TMagrisso, IJWehmeyer, KRKuhlenbeck, DLEichhold, THDobson, RL New cyclooxygenase-2/5-lipoxygenase inhibitors. 3. 7-tert-butyl-2, 3-dihydro-3,3-dimethylbenzofuran derivatives as gastrointestinal safe antiinflammatory and analgesic agents: variations at the 5 position. J Med Chem 41:3515-29 (1998)  
Target
Name:
Prostaglandin G/H synthase 2
Synonyms:
COX2 Cyclooxygenase 2 (COX-2) Cyclooxygenase-2 (COX-2 AA) Cyclooxygenase-2 (COX-2) PGH2_HUMAN PHS II Prostaglandin E synthase/G/H synthase 2 Prostaglandin-endoperoxide synthase 2
Type:
Enzyme
Mol. Mass.:
69003.89
Organism:
Homo sapiens (Human)
Description:
Recombinant Cox-2 provided by Cayman (Cayman Chemical Co.,Ann Arbor, MI).
Residue:
604
  
Inhibitor
Name:
BDBM50408442
Synonyms:
CHEMBL2112567
Type:
Small organic molecule
Emp. Form.:
C19H24O3
Mol. Mass.:
300.3921
SMILES:
CC(C)(C)c1cc(\C=C2/CCOC2=O)cc2c1OCC2(C)C
: