Target
Serine protease 1
Ligand
BDBM17277
Substrate
Meas. Tech.
ChEMBL_212379 (CHEMBL817625)
Ki
33±n/a nM
Citation
 Shaw, KJGuilford, WJDallas, JLKoovakkaat, SKMcCarrick, MALiang, ALight, DRMorrissey, MM (Z,Z)-2,7-Bis(4-amidinobenzylidene)cycloheptan-1-one: identification of a highly active inhibitor of blood coagulation factor Xa. J Med Chem 41:3551-6 (1998)  
Target
Name:
Serine protease 1
Synonyms:
Beta-Trypsin PRSS1 TRY1 TRYP1 Trypsin I
Type:
Enzyme
Mol. Mass.:
25790.52
Organism:
Bos taurus (bovine)
Description:
P00760
Residue:
246
  
Inhibitor
Name:
BDBM17277
Synonyms:
(Z,Z)BABCH CHEMBL55035
Type:
Small organic molecule
Emp. Form.:
C23H24N4O
Mol. Mass.:
372.4629
SMILES:
NC(=N)c1ccc(\C=C2\CCCC\C(=C\c3ccc(cc3)C(N)=N)C2=O)cc1
: