Target
Serine protease 1
Ligand
BDBM17277
Substrate
Meas. Tech.
ChEMBL_212528 (CHEMBL817592)
Ki
33±n/a nM
Citation
 Phillips, GBBuckman, BODavey, DDEagen, KAGuilford, WJHinchman, JHo, EKoovakkat, SLiang, ALight, DRMohan, RNg, HPPost, JMShaw, KJSmith, DSubramanyam, BSullivan, METrinh, LVergona, RWalters, JWhite, KWhitlow, MWu, SXu, WMorrissey, MM Discovery of N-[2-[5-[Amino(imino)methyl]-2-hydroxyphenoxy]-3, 5-difluoro-6-[3-(4, 5-dihydro-1-methyl-1H-imidazol-2-yl)phenoxy]pyridin-4-yl]-N-methylgl y cine (ZK-807834): a potent, selective, and orally active inhibitor of the blood coagulation enzyme factor Xa. J Med Chem 41:3557-62 (1998)  
Target
Name:
Serine protease 1
Synonyms:
Beta-Trypsin PRSS1 TRY1 TRYP1 Trypsin I
Type:
Enzyme
Mol. Mass.:
25790.52
Organism:
Bos taurus (bovine)
Description:
P00760
Residue:
246
  
Inhibitor
Name:
BDBM17277
Synonyms:
(Z,Z)BABCH CHEMBL55035
Type:
Small organic molecule
Emp. Form.:
C23H24N4O
Mol. Mass.:
372.4629
SMILES:
NC(=N)c1ccc(\C=C2\CCCC\C(=C\c3ccc(cc3)C(N)=N)C2=O)cc1
: