Target
Adenosine receptor A3
Ligand
BDBM50511973
Substrate
Meas. Tech.
ChEMBL_1846294 (CHEMBL4346835)
Ki
>1000±n/a nM
Citation
 Jiang, JSeel, CJTemirak, ANamasivayam, VArridu, ASchabikowski, JBaqi, YHinz, SHockemeyer, JMüller, CE A J Med Chem 62:4032-4055 (2019)  
Target
Name:
Adenosine receptor A3
Synonyms:
A3 adenosine receptor (hA3) ADORA3 | Adenosine A3 receptor (A3AR)
Type:
G Protein-Coupled Receptor (GPCR)
Mol. Mass.:
36197.32
Organism:
Homo sapiens (Human)
Description:
P0DMS8
Residue:
318
  
Inhibitor
Name:
BDBM50511973
Synonyms:
CHEMBL4466625
Type:
Small organic molecule
Emp. Form.:
C24H25BrN6O4S
Mol. Mass.:
573.462
SMILES:
CCCn1c(=O)[nH]c2nc([nH]c2c1=O)-c1ccc(cc1)S(=O)(=O)N1CCN(CC1)c1cccc(Br)c1
: