Target
Adenosine receptor A1
Ligand
BDBM50511973
Substrate
Meas. Tech.
ChEMBL_1846293 (CHEMBL4346834)
Ki
>1000±n/a nM
Citation
 Jiang, JSeel, CJTemirak, ANamasivayam, VArridu, ASchabikowski, JBaqi, YHinz, SHockemeyer, JMüller, CE A J Med Chem 62:4032-4055 (2019)  
Target
Name:
Adenosine receptor A1
Synonyms:
A1 adenosine receptor (hA1) AA1R_HUMAN ADORA1 Adenosine A1-receptor Adenosine receptor A1 (hA1) | Adenosine transporter (AdT)
Type:
G Protein-Coupled Receptor (GPCR)
Mol. Mass.:
36520.92
Organism:
Homo sapiens (Human)
Description:
P30542
Residue:
326
  
Inhibitor
Name:
BDBM50511973
Synonyms:
CHEMBL4466625
Type:
Small organic molecule
Emp. Form.:
C24H25BrN6O4S
Mol. Mass.:
573.462
SMILES:
CCCn1c(=O)[nH]c2nc([nH]c2c1=O)-c1ccc(cc1)S(=O)(=O)N1CCN(CC1)c1cccc(Br)c1
: