Target
Retinoic acid receptor alpha
Ligand
BDBM50066906
Substrate
Meas. Tech.
ChEMBL_197392 (CHEMBL799711)
EC50
620±n/a nM
Citation
 Benbrook, DMSubramanian, SGale, JBLiu, SBrown, CWBoehm, MFBerlin, KD Synthesis and characterization of heteroarotinoids demonstrate structure specificity relationships. J Med Chem 41:3753-7 (1998)  
Target
Name:
Retinoic acid receptor alpha
Synonyms:
NR1B1 RAR-alpha RARA_HUMAN Retinoic acid receptor alpha/Retinoid X receptor alpha Retinoid receptor
Type:
PROTEIN
Mol. Mass.:
50778.87
Organism:
Homo sapiens (Human)
Description:
ChEMBL_1466191
Residue:
462
  
Inhibitor
Name:
BDBM50066906
Synonyms:
4-[(E)-2-(4,4-Dimethyl-thiochroman-6-yl)-propenyl]-benzoic acid methyl ester | CHEMBL125587
Type:
Small organic molecule
Emp. Form.:
C22H24O2S
Mol. Mass.:
352.49
SMILES:
COC(=O)c1ccc(\C=C(/C)c2ccc3SCCC(C)(C)c3c2)cc1
: