Target
Suppressor of tumorigenicity 14 protein
Ligand
BDBM50512103
Substrate
Meas. Tech.
ChEMBL_1847487 (CHEMBL4348028)
Ki
2.5±n/a nM
Citation
 de Siqueira, LRPde Moraes Gomes, PATde Lima Ferreira, LPde Melo Ręgo, MJBLeite, ACL Multi-target compounds acting in cancer progression: Focus on thiosemicarbazone, thiazole and thiazolidinone analogues. Eur J Med Chem 170:237-260 (2019)  
Target
Name:
Suppressor of tumorigenicity 14 protein
Synonyms:
Epithin MT-SP1 PRSS14 SNC19 ST14_HUMAN Suppressor of tumorigenicity 14 protein TADG15
Type:
Single-pass type II membrane protein
Mol. Mass.:
94769.23
Organism:
Homo sapiens (Human)
Description:
Q9Y5Y6
Residue:
855
  
Inhibitor
Name:
BDBM50512103
Synonyms:
CHEMBL4464524
Type:
Small organic molecule
Emp. Form.:
C42H61N13O8S
Mol. Mass.:
908.081
SMILES:
CC(C)C[C@H](NC(=O)[C@H](CCCNC(N)=N)NC(=O)[C@H](CCCCN)NC(C)=O)C(=O)N[C@@H](CCCNC(N)=N)C(=O)c1nc2ccc(cc2s1)C(=O)NCc1ccc(cc1)C(O)=O
: