Target
L-lactate dehydrogenase A chain
Ligand
BDBM50066978
Substrate
Meas. Tech.
ChEMBL_96428 (CHEMBL706376)
Ki
22000±n/a nM
Citation
 Deck, LMRoyer, REChamblee, BBHernandez, VMMalone, RRTorres, JEHunsaker, LAPiper, RCMakler, MTVander Jagt, DL Selective inhibitors of human lactate dehydrogenases and lactate dehydrogenase from the malarial parasite Plasmodium falciparum. J Med Chem 41:3879-87 (1998)  
Target
Name:
L-lactate dehydrogenase A chain
Synonyms:
Cell proliferation-inducing gene 19 protein L-lactate dehydrogenase A Chain LDH-A LDHA Lactate dehydrogenase A (LDHA) | Renal carcinoma antigen NY-REN-59
Type:
Protein
Mol. Mass.:
36694.85
Organism:
Homo sapiens (Human)
Description:
P00338::PDB Code: 4ajp
Residue:
332
  
Inhibitor
Name:
BDBM50066978
Synonyms:
2,3-Dihydroxy-4,6-dimethyl-naphthalene-1-carboxylic acid | CHEMBL127645
Type:
Small organic molecule
Emp. Form.:
C13H12O4
Mol. Mass.:
232.232
SMILES:
Cc1ccc2c(C(O)=O)c(O)c(O)c(C)c2c1
: