Target
Leukocyte tyrosine kinase receptor
Ligand
BDBM50512318
Substrate
Meas. Tech.
ChEMBL_1848572 (CHEMBL4349113)
IC50
0.567000±n/a nM
Citation
 Riggs, JRElsner, JCashion, DRobinson, DTehrani, LNagy, MFultz, KEKrishna Narla, RPeng, XTran, TKulkarni, ABahmanyar, SCondroski, KPagarigan, BFenalti, GLeBrun, LLeftheris, KZhu, DBoylan, JF Design and Optimization Leading to an Orally Active TTK Protein Kinase Inhibitor with Robust Single Agent Efficacy. J Med Chem 62:4401-4410 (2019)  
Target
Name:
Leukocyte tyrosine kinase receptor
Synonyms:
LTK TYK1
Type:
PROTEIN
Mol. Mass.:
91679.76
Organism:
Homo sapiens (Human)
Description:
ChEMBL_586334
Residue:
864
  
Inhibitor
Name:
BDBM50512318
Synonyms:
CHEMBL4546504
Type:
Small organic molecule
Emp. Form.:
C25H29ClF3N5O4
Mol. Mass.:
555.977
SMILES:
C[C@@H](Oc1cc(ccc1Nc1nc(O[C@H]2CC[C@@](C)(O)CC2)c2c(Cl)c[nH]c2n1)C(=O)N(C)C)C(F)(F)F
: