Target
Malate dehydrogenase, cytoplasmic
Ligand
BDBM50512580
Substrate
Meas. Tech.
ChEMBL_1849702 (CHEMBL4350243)
IC50
>10000±n/a nM
Citation
 Mullarky, EXu, JRobin, ADHuggins, DJJennings, ANoguchi, NOlland, ALakshminarasimhan, DMiller, MTomita, DMichino, MSu, TZhang, GStamford, AWMeinke, PTKargman, SCantley, LC Inhibition of 3-phosphoglycerate dehydrogenase (PHGDH) by indole amides abrogates de novo serine synthesis in cancer cells. Bioorg Med Chem Lett 29:2503-2510 (2019)  
Target
Name:
Malate dehydrogenase, cytoplasmic
Synonyms:
Cytosolic malate dehydrogenase MDHA Malate dehydrogenase cytoplasmic | Malate dehydrogenase, cytoplasmic
Type:
PROTEIN
Mol. Mass.:
36427.72
Organism:
Homo sapiens (Human)
Description:
ChEMBL_1456624
Residue:
334
  
Inhibitor
Name:
BDBM50512580
Synonyms:
CHEMBL4585294
Type:
Small organic molecule
Emp. Form.:
C25H21Cl2N3O3
Mol. Mass.:
482.359
SMILES:
Cn1c(cc2c(Cl)c(Cl)ccc12)C(=O)NC1(COC1)c1ccc(cc1)[C@@H](O)c1cccnc1
: